{"text_format":"1","workbook":"xlsx","n_sheets":3,"sheets":["UVCG-I-OM-04","Dependencias","Puestos"],"not_rendered":{"charts":0,"images":2,"macros":1,"external_links":0,"defined_names":6,"comments":0,"pivot_tables":0},"unopened":[],"bounds":{"document_bytes":16777216,"sheet_cells":100000,"rows_first":2000,"rows_last":500,"rows_between":2000,"halvings":0,"cell_chars":16384,"cell_head_chars":4096},"cells_cut":0,"cells_raw":0,"read":"whole","date_system":"1900"}

{"sheet":"UVCG-I-OM-04","index":0,"n_rows":25,"n_cols":17,"rows_kept":25,"cut":false,"hidden":false,"merged":[[11,2,11,8],[12,2,12,8],[9,2,9,8],[10,2,10,8],[9,9,9,13],[10,9,10,13],[11,9,11,13],[12,9,12,13],[24,1,24,3],[24,5,24,10],[24,12,24,13],[17,3,17,4],[23,5,23,10],[20,5,20,10],[20,1,20,3],[23,1,23,3],[20,12,20,13],[23,12,23,13],[17,6,17,10],[0,0,0,1],[7,1,7,13],[2,1,2,2],[4,1,4,2],[5,1,5,2],[4,3,4,13],[2,3,2,12],[3,1,3,2],[6,1,6,2],[6,3,6,5],[15,9,15,13],[13,2,13,8],[13,9,13,13],[14,2,14,8],[14,9,14,13],[15,2,15,8]]}
[null,null,null,null,null,null,null,null,null,null,null,null,null,null,null,null,{"$f":"VLOOKUP(B8,#REF!,3,FALSE)","v":{"$error":"#REF!"}}]
[]
[null,"Entrega  Recepción por cambio de:",null,"Seleccione …"]
[null,"Clave de Entidad Académica o Dependencia:"]
[null,"Entidad Académica o Dependencia :",null,{"$f":"IF(D$4=0,\"…..\",VLOOKUP(D$4,Dependencias!$A$1:$C$300,2,FALSE))","v":"….."}]
[null,"Región :",null,{"$f":"IF(D$4=0,\"…..\",VLOOKUP(D$4,Dependencias!$A$1:$C$300,3,FALSE))","v":"….."}]
[null,"Fecha de corte de la información:",null,"…."]
[null,"MARCO NORMATIVO DE ACTUACIÓN VIGENTE"]
[]
[null,"No.","Descripción del documento",null,null,null,null,null,null,"Observaciones"]
[]
[]
[]
[]
[]
[]
[]
[null,null,"Lugar y fecha   .",null,null,"Ver., a ",{"$f":"NOW()","v":"2017-03-29T18:25:34.110"}]
[]
[]
[null,"Elaboró",null,null,null,"Entrega",null,null,null,null,null,null,"Recibe"]
[]
[]
[]
[null,"Nombre y firma",null,null,null,"Nombre y firma",null,null,null,null,null,null,"Nombre y firma"]

{"sheet":"Dependencias","index":1,"n_rows":280,"n_cols":3,"rows_kept":280,"cut":false,"hidden":true,"merged":[]}
["DEPENDENCIA","DESCRIPCIÓN","ZONA"]
[11101,"UNIDAD ACADEMICA DE INGENIERIA Y CIENCIAS QUIMICAS","XALAPA"]
[11102,"FACULTAD DE INGENIERIA CIVIL","XALAPA"]
[11103,"FACULTAD DE INGENIERIA MECANICA Y ELECTRICA","XALAPA"]
[11104,"FACULTAD DE CIENCIAS QUIMICAS","XALAPA"]
[11105,"FACULTAD DE QUIMICA FARMACEUTICA BIOLOGICA","XALAPA"]
[11106,"FACULTAD DE FISICA E INTELIGENCIA ARTIFICIAL","XALAPA"]
[11107,"FACULTAD DE MATEMATICAS","XALAPA"]
[11108,"FACULTAD DE ARQUITECTURA","XALAPA"]
[11109,"FACULTAD DE INSTRUMENTACION ELECTRONICA","XALAPA"]
[11110,"INSTITUTO DE CIENCIAS BASICAS","XALAPA"]
[11112,"DEPARTAMENTO DE INTELIGENCIA ARTIFICIAL","XALAPA"]
[11113,"UNIDAD DE SERVICIOS DE APOYO DE RESOLUCION ANALITICA (SARA)","XALAPA"]
[11114,"CENTRO DE CIENCIAS DE LA TIERRA","XALAPA"]
[11201,"FACULTAD DE DERECHO","XALAPA"]
[11202,"UNIDAD ACADEMICA DE HUMANIDADES","XALAPA"]
[11203,"FACULTAD DE IDIOMAS","XALAPA"]
[11204,"FACULTAD DE PEDAGOGIA","XALAPA"]
[11205,"FACULTAD DE LETRAS ESPAÑOLAS","XALAPA"]
[11206,"FACULTAD DE HISTORIA","XALAPA"]
[11207,"FACULTAD DE FILOSOFIA","XALAPA"]
[11208,"FACULTAD DE ANTROPOLOGIA","XALAPA"]
[11209,"FACULTAD DE SOCIOLOGIA","XALAPA"]
[11211,"INSTITUTO DE ANTROPOLOGIA","XALAPA"]
[11212,"MUSEO ANTROPOLOGÍA","XALAPA"]
[11213,"INSTITUTO DE INVESTIGACIONES JURIDICAS","XALAPA"]
[11214,"INSTITUTO DE INVESTIGACIONES HISTÓRICO SOCIALES","XALAPA"]
[11215,"INSTITUTO DE INVESTIGACIONES LINGÜISTICO LITERARIAS","XALAPA"]
[11216,"INSTITUTO DE INVESTIGACIONES EN EDUCACION","XALAPA"]
[11217,"CENTRO DE INVESTIGACION EN DOCUMENTACION SOBRE LA UNIVERSIDAD","XALAPA"]
[11218,"INSTITUTO DE FILOSOFIA","XALAPA"]
[11219,"CENTRO DE ESTUDIOS DE LA CULTURA Y LA COMUNICACION","XALAPA"]
[11220,"CENTRO DE ESTUDIOS SOBRE DERECHO, GLOBALIZACION Y SEGURIDAD","XALAPA"]
[11301,"FACULTAD DE CONTADURIA Y ADMINISTRACION","XALAPA"]
[11302,"UNIDAD ACADEMICA DE ECONOMIA Y ESTADISTICA","XALAPA"]
[11303,"FACULTAD DE ECONOMIA","XALAPA"]
[11304,"FACULTAD DE ESTADISTICA E INFORMATICA","XALAPA"]
[11305,"INSTITUTO DE INVESTIGACIONES Y ESTUDIOS SUPERIORES ECONOMICOS Y SOCIALES","XALAPA"]
[11306,"INSTITUTO DE INVESTIGACIONES Y ESTUDIOS SUPERIORES DE CIENCIAS ADMINISTRATIVAS","XALAPA"]
[11307,"INSTITUTO DE CONTADURIA PUBLICA","XALAPA"]
[11309,"FACULTAD DE CIENCIAS ADMINISTRATIVAS Y SOCIALES","XALAPA"]
[11310,"CENTRO DE ESTUDIOS DE OPINION Y ANALISIS DE LA UNIVERSIDAD VERACRUZANA","XALAPA"]
[11401,"UNIDAD ACADEMICA DE CIENCIAS DE LA SALUD","XALAPA"]
[11402,"FACULTAD DE MEDICINA","XALAPA"]
[11403,"FACULTAD DE ODONTOLOGIA","XALAPA"]
[11404,"FACULTAD DE BIOANALISIS","XALAPA"]
[11405,"FACULTAD DE NUTRICION","XALAPA"]
[11406,"FACULTAD DE ENFERMERIA","XALAPA"]
[11407,"FACULTAD DE PSICOLOGIA","XALAPA"]
[11408,"INSTITUTO DE CIENCIAS DE LA SALUD","XALAPA"]
[11409,"INSTITUTO DE INVESTIGACIONES PSICOLOGICAS","XALAPA"]
[11410,"CLINICA UNIVERSITARIA DE SALUD REPRODUCTIVA Y SEXUAL","XALAPA"]
[11411,"INSTITUTO DE SALUD PUBLICA","XALAPA"]
[11412,"CENTRO PARA EL DESARROLLO HUMANO E INTEGRAL DE LOS UNIVERSITARIOS","XALAPA"]
[11413,"INSTITUTO DE PSICOLOGIA Y EDUCACION","XALAPA"]
[11414,"CENTRO DE INVESTIGACIONES BIOMEDICAS","XALAPA"]
[11415,"CENTRO DE INVESTIGACIONES CERABRALES","XALAPA"]
[11501,"UNIDAD ACADEMICA DE CIENCIAS BIOLOGICAS Y AGROPECUARIAS","XALAPA"]
[11502,"FACULTAD DE BIOLOGIA","XALAPA"]
[11503,"FACULTAD DE CIENCIAS AGRICOLAS","XALAPA"]
[11504,"INSTITUTO DE INVESTIGACIONES BIOLOGICAS","XALAPA"]
[11505,"INSTITUTO DE NEUROETOLOGIA","XALAPA"]
[11506,"INSTITUTO DE INVESTIGACIONES FORESTALES","XALAPA"]
[11507,"UNIDAD DE INV. DE ECOLOGIA DE PESQUERIAS","XALAPA"]
[11508,"INSTITUTO DE BIOTECNOLOGIA Y ECOLOGIA APLICADA","XALAPA"]
[11509,"CENTRO DE INVESTIGACIONES TROPICALES","XALAPA"]
[11510,"INSTITUTO DE INVESTIGACIONES MULTIDISCIPLINARIAS","XALAPA"]
[11601,"UNIDAD ACADEMICA DE ARTES","XALAPA"]
[11602,"FACULTAD DE MÚSICA","XALAPA"]
[11603,"FACULTAD DE DANZA","XALAPA"]
[11604,"FACULTAD DE ARTES PLASTICAS","XALAPA"]
[11605,"FACULTAD DE TEATRO","XALAPA"]
[11606,"INSTITUTO DE ARTES PLASTICAS","XALAPA"]
[11607,"CENTRO DE INICIACION MUSICAL INFANTIL","XALAPA"]
[11608,"CENTRO DE ESTUDIOS DE JAZZ (JAZZUV)","XALAPA"]
[11701,"DIRECCION GENERAL DEL SISTEMA DE ENSEÑANZA ABIERTA","XALAPA"]
[11702,"ESCUELA PARA ESTUDIANTES EXTRANJEROS","XALAPA"]
[11703,"DIRECCION GENERAL DE LA UNIDAD DE ESTUDIOS DE POSGRADO","XALAPA"]
[11704,"DIRECCION DE LA UNIVERSIDAD VERACRUZANA INTERCULTURAL","XALAPA"]
[11705,"DIRECCION DE LOS CENTROS DE IDIOMAS","XALAPA"]
[11706,"COORDINACION UNIVERSITARIA DE OBSERVATORIOS METROPOLITANOS","XALAPA"]
[11707,"CENTRO DE ESTUDIOS CHINA-VERACRUZ","XALAPA"]
[11708,"COORDINACION UNIVERSITARIA PARA LA SUSTENTABILIDAD","XALAPA"]
[11709,"CENTRO DE ECOALFABETIZACION Y DIALOGO DE SABERES","XALAPA"]
[11710,"DIRECCION GENERAL DE RELACIONES INTERNACIONALES","XALAPA"]
[11711,"CENTRO DE ESTUDIOS E INVESTIGACIONES EN CONOCIMIENTO Y APRENDIZAJE HUMANO","XALAPA"]
[11712,"DIRECCIÓN DE MEDIOS DE COMUNICACIÓN","XALAPA"]
[11713,"DIRECCIÓN DE COMUNICACIÓN DE LA CIENCIA","XALAPA"]
[11717,"DIRECCIÓN DE NORMATIVIDAD","XALAPA"]
[11718,"COORDINACIÓN DE COOPERACIÓN ACADÉMICA","XALAPA"]
[11719,"COORDINACIÓN DE PROGRAMAS Y SERVICIOS","XALAPA"]
[11720,"COORDINACIÓN DE MOVILIDAD ESTUDIANTIL Y ACADÉMICA","XALAPA"]
[11801,"TALLER LIBRE ARTES","XALAPA"]
[11802,"CENTRO DE IDIOMAS","XALAPA"]
[11803,"ORGANIZACION TEATRAL UV","XALAPA"]
[11804,"ORBIS TERTIUS","XALAPA"]
[11805,"CORO","XALAPA"]
[11806,"GRUPO DE RECITALISTAS","XALAPA"]
[11807,"ENSAMBLE CLÁSICO DE GUITARRAS","XALAPA"]
[11808,"ORQUESTA UNIVERSITARIA DE MUSICA POPULAR","XALAPA"]
[11809,"TLEN HUICANI","XALAPA"]
[11810,"BALLET FOLKLORICO","XALAPA"]
[11811,"ORQUESTA SINFONICA XALAPA","XALAPA"]
[11812,"ORQUESTA DE SALSA","XALAPA"]
[11813,"GALERIA RAMON ALVA DE LA CANAL","XALAPA"]
[11901,"ADMINISTRACION CENTRAL","XALAPA"]
[11902,"RECTORIA","XALAPA"]
[11904,"OFICINA DEL ABOGADO GENERAL","XALAPA"]
[11905,"DIRECCION DE ASUNTOS JURIDICOS","XALAPA"]
[11906,"CONTRALORIA GENERAL","XALAPA"]
[11907,"DIRECCION DE AUDITORIA INTERNA                    ","XALAPA"]
[11908,"DIRECCION DE PLANEACION INSTITUCIONAL","XALAPA"]
[11909,"COORDINACION TÉCNICA DE LA DIR. PLANEACIÓN INSTITUCIONAL","XALAPA"]
[11910,"DEFENSORIA DE LOS DERECHOS DE LOS UNIVERSITARIOS","XALAPA"]
[11911,"DIRECCION GENERAL DE TECNOLOGIA DE LA INFORMACION","XALAPA"]
[11912,"DIRECCION DE PROYECTOS, CONSTRUCCIONES Y MANTENIMIENTO","XALAPA"]
[11913,"SECRETARIA DE LA RECTORIA","XALAPA"]
[11915,"DIRECCION GENERAL DE COMUNICACION UNIVERSITARIA","XALAPA"]
[11916,"DEPARTAMENTO DE CINEMATOGRAFIA","XALAPA"]
[11917,"DEPARTAMENTO DE RADIO","XALAPA"]
[11918,"DEPARTAMENTO DE MEDIOS AUDIOVISUALES","XALAPA"]
[11919,"DIRECCION DE VINCULACION GENERAL","XALAPA"]
[11920,"SECRETARIA ACADEMICA","XALAPA"]
[11921,"DIRECCION GENERAL DEL AREA ACADEMICA TECNICA","XALAPA"]
[11922,"DIRECCION GENERAL DEL AREA ACADEMICA DE HUMANIDADES","XALAPA"]
[11923,"DIRECCION GENERAL DEL AREA ACADEMICA ECONOMICO ADMINISTRATIVA","XALAPA"]
[11924,"DIRECCION GENERAL DEL AREA ACADEMICA DE CIENCIAS DE LA SALUD","XALAPA"]
[11925,"DIRECCION GENERAL DEL AREA ACADEMICA BIOLOGICO AGROPECUARIA","XALAPA"]
[11926,"DIRECCION GENERAL DEL AREA ACADEMICA DE ARTES","XALAPA"]
[11927,"DIRECCION GENERAL DE INVESTIGACIONES","XALAPA"]
[11928,"DIRECCION GENERAL DE  DESARROLLO ACADEMICO E INNOVACION EDUCATIVA","XALAPA"]
[11929,"DIRECCION GENERAL DE ADMINISTRACION ESCOLAR","XALAPA"]
[11930,"DIRECCION DE SERVICIOS ESCOLARES                  ","XALAPA"]
[11932,"COORDINACION DE INTEGRACION SALARIAL","XALAPA"]
[11935,"DIRECCION GENERAL DE BIBLIOTECAS","XALAPA"]
[11938,"COORDINACION REGIONAL DE BIBLIOTECAS XALAPA","XALAPA"]
[11939,"OFICIALIA MAYOR                                   ","XALAPA"]
[11940,"DEPARTAMENTO DE SERVICIO SOCIAL                   ","XALAPA"]
[11941,"DIRECCIÓN DE FORTALECIMIENTO ACADÉMICO ","XALAPA"]
[11942,"DIRECCIÓN DE INNOVACIÓN EDUCATIVA","XALAPA"]
[11943,"SECRETARIA DE ADMINISTRACION Y FINANZAS","XALAPA"]
[11944,"DIRECCION GENERAL DE RECURSOS FINANCIEROS","XALAPA"]
[11945,"DEPARTAMENTO DE CAJA                              ","XALAPA"]
[11946,"DIRECCION DE INGRESOS","XALAPA"]
[11947,"DIRECCION DE EGRESOS","XALAPA"]
[11948,"DIRECCION DE PRESUPUESTOS","XALAPA"]
[11949,"DEPARTAMENTO DE CONTROL PRESUPUESTAL DEL GASTO    ","XALAPA"]
[11950,"DEPARTAMENTO DE CONTROL DE PLAZAS                 ","XALAPA"]
[11951,"DIRECCION DE CONTABILIDAD","XALAPA"]
[11954,"DIRECCION DE CONTROL PATRIMONIAL","XALAPA"]
[11955,"DIRECCION DE RECURSOS MATERIALES","XALAPA"]
[11956,"DEPARTAMENTO DE ALMACEN                           ","XALAPA"]
[11957,"DIRECCION GENERAL DE RECURSOS HUMANOS","XALAPA"]
[11958,"DIRECCION DE PERSONAL","XALAPA"]
[11963,"DIRECCION DE RELACIONES LABORALES","XALAPA"]
[11964,"DIRECCION DE NOMINAS","XALAPA"]
[11967,"DIRECCION GENERAL DE INFORMATICA                  ","XALAPA"]
[11968,"DIRECCION DE SERVICIOS DE RED E INFRAESTRUCTURA TECNOLOGICA","XALAPA"]
[11969,"DIRECCION DE EXTENSION DE SERVICIOS TECNOLOGICOS","XALAPA"]
[11970,"DIRECCION DE DESARROLLO INFORMÁTICO DE APOYO ACADÉMICO","XALAPA"]
[11971,"DIRECCION DE SERVICIOS INFORMATICOS ADMINISTRATIVOS","XALAPA"]
[11972,"UNIDAD DEL SISTEMA INTEGRAL DE INFORMACION UNIVERSITARIA","XALAPA"]
[11973,"DIRECCION DE OPERATIVIDAD E IMPACTO DE LAS TECNOLOGIAS DE INFORMACION","XALAPA"]
[11974,"UNIDAD DE ORGANIZACION Y METODOS","XALAPA"]
[11975,"DEPARTAMENTO DE SERVICIOS GENERALES","XALAPA"]
[11976,"UNIDAD DE SERVICIOS BIBLIOTECARIOS Y DE INFORMACIÓN","XALAPA"]
[11977,"COORDINACION DE DIFUSION Y EXTENSION DE LA CULTURA","XALAPA"]
[11978,"DIRECCION GENERAL DE LA UNIVERSIDAD VIRTUAL","XALAPA"]
[11979,"DIRECCION DEL AREA DE FORMACION BASICA GENERAL","XALAPA"]
[11980,"DIRECCION DE ACTIVIDADES DEPORTIVAS","XALAPA"]
[11981,"DIRECCION DE EDITORIAL","XALAPA"]
[11982,"DEPARTAMENTO DE DISTRIBUCION                      ","XALAPA"]
[11983,"COORDINACION DE TRANSPARENCIA Y ACCESO A LA INFORMACION","XALAPA"]
[11985,"JUNTA DE GOBIERNO","XALAPA"]
[12801,"TALLER LIBRE DE ARTES","XALAPA"]
[13801,"TALLER LIBRE DE ARTES","XALAPA"]
[21301,"FACULTAD DE ADMINISTRACION","VERACRUZ"]
[21401,"UNIDAD ACADEMICA DE CIENCIAS DE LA SALUD","VERACRUZ"]
[21402,"FACULTAD DE MEDICINA","VERACRUZ"]
[21403,"FACULTAD DE BIOANÁLISIS","VERACRUZ"]
[21404,"FACULTAD DE NUTRICION","VERACRUZ"]
[21405,"FACULTAD DE PSICOLOGIA","VERACRUZ"]
[21406,"FACULTAD DE ENFERMERIA","VERACRUZ"]
[21407,"INSTITUTO DE  INVESTIGACIONES  MEDICO-BIOLOGICAS","VERACRUZ"]
[21501,"FACULTAD DE MEDICINA VETERINARIA Y ZOOTECNIA","VERACRUZ"]
[21502,"RANCHO TORREON DEL MOLINO","VERACRUZ"]
[21801,"TALLER LIBRE DE ARTES","VERACRUZ"]
[21802,"ORQUESTA TRADICIONAL MOSCOVITA","VERACRUZ"]
[21803,"NEMATATLIN","VERACRUZ"]
[22101,"FACULTAD DE INGENIERÍA","VERACRUZ"]
[22102,"INSTITUTO DE INGENIERIA","VERACRUZ"]
[22103,"CENTRO DE INVESTIGACIONES EN MICRO Y NANOTECNOLOGIA","VERACRUZ"]
[22201,"FACULTAD DE CIENCIAS Y TECNICAS DE  LA COMUNICACION","VERACRUZ"]
[22202,"FACULTAD DE PEDAGOGIA","VERACRUZ"]
[22302,"FACULTAD DE CONTADURIA","VERACRUZ"]
[22401,"FACULTAD DE ODONTOLOGIA","VERACRUZ"]
[22402,"FACULTAD DE EDUCACION FISICA, DEPORTE Y RECREACION","VERACRUZ"]
[22403,"INSTITUTO DE MEDICINA FORENSE","VERACRUZ"]
[22501,"INSTITUTO DE CIENCIAS MARINAS Y PESQUERIAS DE LA UNIVERSIDAD VERACRUZANA","VERACRUZ"]
[22601,"CENTRO DE INICIACION MUSICAL INFANTIL","VERACRUZ"]
[22701,"COORDINACIÓN ACADÉMICA REGIONAL DE  ENSEÑANZA ABIERTA","VERACRUZ"]
[22801,"CENTRO DE IDIOMAS","VERACRUZ"]
[22802,"COORDINACION REGIONAL DE ACTIVIDADES DEPORTIVAS   ","VERACRUZ"]
[22901,"VICE RECTORIA VERACRUZ","VERACRUZ"]
[22902,"SECRETARÍA ACADÉMICA REGIONAL VERACRUZ","VERACRUZ"]
[22903,"SECRETARÍA DE ADMINISTRACIÓN Y FINANZAS REGIONAL VERACRUZ","VERACRUZ"]
[22904,"COORDINACION REGIONAL DE DIFUSION CULTURAL Y EXTENSION UNIVERSITARIA","VERACRUZ"]
[22905,"COORDINACION REGIONAL DE BIBLIOTECAS VERACRUZ","VERACRUZ"]
[22906,"UNIDAD DE SERVICIOS BIBLIOTECARIOS Y DE INFORMACION","VERACRUZ"]
[22907,"CENTRO DE ESTUDIOS Y SERVICIOS EN SALUD","VERACRUZ"]
[22908,"COORD. REGIONAL ÁREA DE FORMACIÓN BASICA GENERAL","VERACRUZ"]
[31101,"FACULTAD DE CIENCIAS QUIMICAS","ORIZABA CORDOBA"]
[31401,"FACULTAD DE ENFERMERIA","ORIZABA CORDOBA"]
[31413,"INSTITUTO DE PSICOLOGIA Y EDUCACION(CEEORI)","ORIZABA CORDOBA"]
[31701,"COORDINACION ACADEMICA REGIONAL DE ENSEÑANZA ABIERTA","ORIZABA CORDOBA"]
[31801,"CENTRO DE IDIOMAS","ORIZABA CORDOBA"]
[31802,"COORDINACION REGIONAL DE ACTIVIDADES DEPORTIVAS   ","ORIZABA CORDOBA"]
[31901,"VICE RECTORIA","ORIZABA CORDOBA"]
[31902,"SECRETARIA ACADÉMICA REGIONAL ORIZABA - CÓRDOBA","ORIZABA CORDOBA"]
[31903,"SECRETARÍA DE ADMINISTRACIÓN Y FINANZAS REGIONAL ORIZABA- CÓRDOBA","ORIZABA CORDOBA"]
[31905,"COORDINACION REGIONAL DE BIBLIOTECAS ORIZABA-CORDOBA","ORIZABA CORDOBA"]
[31908,"COORD.REGIONAL ÁREA DE FORMACIÓN BASICA GENERAL","ORIZABA CORDOBA"]
[32101,"FACULTAD DE ARQUITECTURA","ORIZABA CORDOBA"]
[32413,"INSTITUTO DE PSICOLOGIA Y EDUCACION","ORIZABA CORDOBA"]
[32801,"CENTRO DE IDIOMAS","ORIZABA CORDOBA"]
[32908,"COORD. REG. A FORMACION BASICA GRAL.","ORIZABA CORDOBA"]
[33101,"FACULTAD DE INGENIERIA","ORIZABA CORDOBA"]
[33401,"FACULTAD DE MEDICINA","ORIZABA CORDOBA"]
[34301,"FACULTAD DE CONTADURIA Y ADMINISTRACION","ORIZABA CORDOBA"]
[35501,"FACULTAD DE CIENCIAS BIOLOGICAS Y AGROPECUARIAS","ORIZABA CORDOBA"]
[36401,"FACULTAD DE ODONTOLOGIA","ORIZABA CORDOBA"]
[41101,"FACULTAD DE INGENIERIA CIVIL","POZA RICA TUXPAN"]
[41102,"FACULTAD DE CIENCIAS QUIMICAS","POZA RICA TUXPAN"]
[41103,"FACULTAD DE ARQUITECTURA","POZA RICA TUXPAN"]
[41104,"FACULTAD DE INGENIERIA MECANICA Y ELECTRICA","POZA RICA TUXPAN"]
[41105,"FACULTAD DE INGENIERIA EN ELECTRONICA Y COMUNICACIONES","POZA RICA TUXPAN"]
[41201,"FACULTAD DE PEDAGOGIA","POZA RICA TUXPAN"]
[41202,"FACULTAD DE TRABAJO SOCIAL","POZA RICA TUXPAN"]
[41401,"UNIDAD ACADEMICA DE CIENCIAS DE LA SALUD","POZA RICA TUXPAN"]
[41402,"FACULTAD DE MEDICINA","POZA RICA TUXPAN"]
[41403,"FACULTAD DE ODONTOLOGIA","POZA RICA TUXPAN"]
[41404,"FACULTAD DE PSICOLOGIA","POZA RICA TUXPAN"]
[41405,"FACULTAD DE ENFERMERIA","POZA RICA TUXPAN"]
[41701,"COORDINACION ACADEMICA REGIONAL DE ENSEÑANZA ABIERTA","POZA RICA TUXPAN"]
[41801,"TALLER LIBRE DE ARTES","POZA RICA TUXPAN"]
[41802,"CENTRO DE IDIOMAS","POZA RICA TUXPAN"]
[41803,"COORDINACION REGIONAL DE ACTIVIDADES DEPORTIVAS   ","POZA RICA TUXPAN"]
[41901,"VICE RECTORIA","POZA RICA TUXPAN"]
[41902,"SECRETARIA ACADÉMICA REGIONAL POZA RICA - TUXPAN","POZA RICA TUXPAN"]
[41903,"SECRETARÍA DE ADMINISTRACIÓN Y FINANZAS REGIONAL POZA RICA- TUXPAN","POZA RICA TUXPAN"]
[41905,"COORDINACION REGIONAL DE BIBLIOTECAS POZA RICA - TUXPAN","POZA RICA TUXPAN"]
[41906,"UNIDAD DE SERVICIOS BIBLIOTECARIOS Y DE INFORMACIÓN","POZA RICA TUXPAN"]
[41908,"COORD. REGIONAL ÁREA DE FORMACIÓN BASICA GENERAL","POZA RICA TUXPAN"]
[42301,"FACULTAD DE CONTADURIA","POZA RICA TUXPAN"]
[42501,"FACULTAD DE CIENCIAS BIOLOGICO  AGROPECUARIAS","POZA RICA TUXPAN"]
[42908,"COORD. REG. A. FORMACION BASICA GRAL.","POZA RICA TUXPAN"]
[43801,"TALLER LIBRE DE ARTES","POZA RICA TUXPAN"]
[51101,"FACULTAD DE INGENIERÍA","COATZACOALCOS MINATITLAN"]
[51102,"FACULTAD DE CIENCIAS QUIMICAS","COATZACOALCOS MINATITLAN"]
[51301,"FACULTAD DE CONTADURIA Y ADMINISTRACION","COATZACOALCOS MINATITLAN"]
[51401,"ESCUELA DE ENFERMERIA","COATZACOALCOS MINATITLAN"]
[51701,"COORDINACION ACADEMICA REGIONAL DE ENSEÑANZA ABIERTA","COATZACOALCOS MINATITLAN"]
[51702,"CENTRO REGIONAL DE INFORMATICA COATZACOALCOS","COATZACOALCOS MINATITLAN"]
[51703,"CENTRO DE INVESTIGACION EN RECURSOS ENERGETICOS Y SUSTENTABLES","COATZACOALCOS MINATITLAN"]
[51801,"CENTRO DE IDIOMAS","COATZACOALCOS MINATITLAN"]
[51802,"COORDINACION REGIONAL DE ACTIVIDADES DEPORTIVAS   ","COATZACOALCOS MINATITLAN"]
[51901,"VICE RECTORIA","COATZACOALCOS MINATITLAN"]
[51902,"SECRETARÍA ACADÉMICA REGIONAL COATZACOALCOS - MINATITLÁN","COATZACOALCOS MINATITLAN"]
[51903,"SECRETARÍA DE ADMINISTRACIÓN Y FINANZAS REGIONAL COATZACOALCOS-MINATITLÁN","COATZACOALCOS MINATITLAN"]
[51905,"COORDINACION REGIONAL DE BIBLIOTECAS COATZACOALCOS-MINATITLAN","COATZACOALCOS MINATITLAN"]
[51906,"UNIDAD DE SERVICIOS BIBLIOTECARIOS Y DE INFORMACIÓN","COATZACOALCOS MINATITLAN"]
[51908,"COORD.REGIONAL ÁREA DE FORMACIÓN BASICA GENERAL","COATZACOALCOS MINATITLAN"]
[52201,"FACULTAD DE TRABAJO SOCIAL","COATZACOALCOS MINATITLAN"]
[52401,"UNIDAD ACADEMICA DE CIENCIAS DE LA SALUD Y TRABAJO SOCIAL","COATZACOALCOS MINATITLAN"]
[52402,"FACULTAD DE ODONTOLOGIA","COATZACOALCOS MINATITLAN"]
[52403,"FACULTAD DE MEDICINA","COATZACOALCOS MINATITLAN"]
[52404,"FACULTAD DE ENFERMERIA","COATZACOALCOS MINATITLAN"]
[52901,"UNIDAD DE SERVICIOS BIBLIOTECARIOS Y DE INFORMACIÓN","COATZACOALCOS MINATITLAN"]
[53501,"INGENIERIA EN SISTEMAS DE PRODUCCION AGROPECUARIA","COATZACOALCOS MINATITLAN"]
[55108,"COORDINACIÓN ADMINISTRATIVA DEL SISTEMA DE ATENCIÓN INTEGRAL A LA SALUD","XALAPA"]

{"sheet":"Puestos","index":2,"n_rows":36,"n_cols":2,"rows_kept":36,"cut":false,"hidden":true,"merged":[]}
["nPuesto","sDPuesto"]
[null,"Seleccione …"]
[1203,"ABOGADO GENERAL"]
[1217,"ADMINISTRADOR"]
[1220,"ASESOR"]
[1202,"CONTRALOR GENERAL"]
[1214,"COORDINADOR ACADEMICO"]
[1201,"COORDINADOR DE ASESORES"]
[1222,"COORDINADOR DE PROCESO/PROGRAMA"]
[1104,"COORDINADOR GENERAL DE EXTENSIÓN Y DIFUSION CULTURAL"]
[1109,"DIRECTOR DE UNIDAD ACADEMICA"]
[1205,"DIRECTOR ADMINISTRATIVO"]
[1211,"DIRECTOR ARTISTICO"]
[1110,"DIRECTOR DE FACULTAD"]
[1209,"DIRECTOR DE HOSPITAL DE GINECOLOGIA"]
[1111,"DIRECTOR DE INSTITUTO"]
[1204,"DIRECTOR GENERAL ADMINISTRATIVO"]
[1106,"DIRECTOR GENERAL DE AREA ACADEMICA"]
[1107,"DIRECTOR GENERAL DE INVESTIGACIONES"]
[1108,"DIRECTOR GENERAL DEL SISTEMA DE ENSEÑANZA ABIERTA"]
[1210,"JEFE DE CARRERA"]
[1212,"JEFE DE CENTRO"]
[1213,"JEFE DE DEPARTAMENTO ACADEMICO"]
[1215,"JEFE DE DEPARTAMENTO ADMINISTRATIVO"]
[1207,"OFICIAL MAYOR"]
[1101,"RECTOR"]
[1112,"SEC. DE UNIDAD ACADEMICA"]
[1116,"SECRETARIA DE LA RECTORIA"]
[1102,"SECRETARIO ACADEMICO"]
[1103,"SECRETARIO DE ADMINISTRACIÓN Y FINANZAS"]
[1114,"SECRETARIO DE FACULTAD"]
[1115,"SECRETARIO DE INSTITUTO"]
[1113,"SECRETARIO DEL SISTEMA DE ENSEÑANZA ABIERTA"]
[1219,"SECRETARIO PARTICULAR DEL RECTOR"]
[1206,"SECRETARIO REGIONAL"]
[1105,"VICERECTOR"]